{"text_format":"3","workbook":"xlsx","n_sheets":6,"sheets":["Simulador ","Listas","Tabla Consolidada","RangoTasa","Hoja1","Reglas de CI"],"not_rendered":{"images":6,"defined_names":31,"comments":3},"read":"whole","date_system":"1900"}

{"sheet":"Simulador ","index":0,"n_rows":119,"n_cols":54,"rows_kept":119,"merged":[[0,18,1,22],[1,33,1,34],[2,18,2,19],[2,20,2,21],[3,18,3,19],[3,20,3,21],[3,23,3,25],[4,18,4,19],[4,20,4,21],[4,23,4,25],[5,18,5,19],[5,20,5,21],[5,23,5,25],[5,33,5,34],[5,37,5,38],[6,18,6,19],[6,20,6,21],[6,23,6,25],[7,18,7,19],[7,20,7,21],[7,23,7,25],[8,18,8,19],[8,20,8,21],[9,18,9,19],[9,20,9,21],[9,33,9,34],[10,18,10,19],[10,20,10,21],[11,18,11,19],[11,20,11,21],[12,18,12,19],[12,20,12,21],[13,18,13,19],[13,20,13,21],[30,18,30,27],[38,18,38,27],[39,18,39,19],[40,18,40,19],[41,18,41,19],[42,18,42,19],[43,18,43,19],[44,18,44,19],[45,18,45,19],[46,18,46,19],[47,18,47,19],[48,18,48,19],[49,18,49,19],[50,18,50,19],[51,18,51,19],[52,18,52,19],[53,18,53,19],[54,18,54,19],[55,18,55,19],[56,18,56,19],[57,18,57,19],[58,18,58,19],[59,18,59,19],[60,18,60,19],[61,18,61,19],[62,18,62,19],[63,18,63,19],[64,18,64,19],[65,18,65,19],[66,18,66,19],[67,18,67,19],[68,18,68,19],[69,18,69,19],[70,18,70,19],[71,18,71,19],[72,18,72,19],[73,18,73,19],[74,18,74,19],[75,18,75,19],[76,18,76,19],[77,18,77,19],[78,18,78,19],[79,18,79,19],[80,18,80,19],[81,18,81,19],[82,18,82,19],[83,18,83,19],[84,18,84,19],[85,18,85,19],[86,18,86,19],[87,18,87,19],[88,18,88,19],[89,18,89,19],[90,18,90,19],[91,18,91,19],[92,18,92,19],[93,18,93,19],[94,18,94,19],[95,18,95,19],[96,18,96,19],[97,18,97,19],[98,18,98,19],[99,18,99,19],[100,18,100,19],[101,18,101,19],[102,18,102,19],[103,18,103,19],[104,18,104,19],[105,18,105,19],[106,18,106,19],[107,18,107,19],[108,18,108,19],[109,18,109,19],[110,18,110,19],[111,18,111,19],[112,18,112,19],[113,18,113,19],[115,17,117,27]]}
[]
[{"$nulls":25},"Fecha:",{"$f":"TODAY()","v":"2025-02-20"},{"$nulls":6},{"$f":"Listas!AF1","v":"Rango de N° de Cuotas"},{"$nulls":3},"Filtros",{"$f":"IF(VLOOKUP(U5,Listas!$H$27:$I$42,2,FALSE)=Listas!A19,Listas!H21,Listas!H2)","v":"VIVIENDA"},{"$f":"IF(AND(U3=\"GRUPAL\",U5=\"CRECE Y MEJORA\"),U9,IF(VLOOKUP(U9,Listas!H46:I60,2,FALSE)=Listas!A19,Listas!O25,Listas!O2))","v":16},{"$f":"IF(VLOOKUP(U13,Listas!H62:I64,2,FALSE)=Listas!A19,Listas!U7,Listas!V2)","v":"MENSUAL"},{"$f":"IF(OR(U14=Listas!AC2,U14=Listas!AC3,U14=Listas!AC4,U14=Listas!AC5,U14=Listas!AC6,U14=Listas!AC7,U14=Listas!AC8,U14=Listas!AC9,U14=Listas!AC10),Listas!AC13,Listas!AC2)","v":"No"}]
[{"$nulls":18},"LINEA NEGOCIO ↓",null,"INDIVIDUAL",null,null,"RESULTADOS DE SIMULACIÓN",{"$nulls":9},{"$f":"Listas!AF2","v":"Min"},{"$f":"Listas!AG2","v":6},{"$f":"CONCATENATE(AH3,\" \",AI3)","v":"Min 6"}]
[{"$nulls":18},"Moneda ↓",null,"SOLES",null,null,"TEA (Tasa Efectiva Anual - Fija)",null,null,{"$f":"IF(Listas!AO5=Listas!AP3,ROUND((1+U11)^12-1,6),'Simulador '!U11)","v":{"v":0.601032,"d":"60.1032%"}},{"$nulls":6},{"$f":"Listas!AF3","v":"Max"},{"$f":"Listas!AG3","v":72},{"$f":"CONCATENATE(AH4,\" \",AI4)","v":"Max 72"}]
[{"$nulls":18},"Producto ↓",null,"CRECE Y MEJORA",null,null,"TCEA (Tasa de Costo Efectiva Anual)",null,null,{"$f":"IF(C26=\"Recalcular\",\"Recalcular\",ROUND(C26,4))","v":{"v":0.7139,"d":"71.3900%"}}]
[{"$nulls":18},"Monto Otorgado",null,{"v":2000,"d":"2,000 "},null,null,"Tasa Seguro Desgravamen",null,null,{"$f":"IF(OR(Listas!$K$6=Listas!$L$3,Listas!$K$6=Listas!$L$4),\"No Aplica\",IF(AND(Listas!H21=Listas!I17,Listas!U7=Listas!Y3),'Simulador '!AI28,IF(AND(Listas!H21=Listas!I17,Listas!U7=Listas!Y4),'Simulador '!AI29,IF(Listas!H21=Listas!I16,'Simulador '!AI31,IF(Listas!D5=Listas!C2,IF(AND(Listas!A5=Listas!B2,Listas!K6=Listas!L5,U6<=$AI$23),AK23,IF(AND(Listas!A5=Listas!B2,Listas!K6=Listas!L5,U6<=$AI$24),AK24,IF(AND(Listas!A5=Listas!B2,Listas!K6=Listas!L5,U6>$AI$24),AK25,IF(AND(Listas!A5=Listas!B2,U6<=$AI$23),AJ23,IF(AND(Listas!A5=Listas!B2,U6<=$AI$24),AJ24,IF(AND(Listas!A5=Listas!B2,U6>$AI$24),AJ25,IF(AND(Listas!A5=Listas!B2,(U6*$T$120)<=$AI$23),AJ23,IF(AND(Listas!A5=Listas!B2,(U6*$T$120)<=$AI$24),AJ24,AJ25)))))))))))))","v":{"v":6.45E-3,"d":"0.645%"}},{"$nulls":6},{"$f":"Listas!AI1","v":"Rango de Monto"},{"$nulls":3},"FILTRO SEGURO DESGRAVAMEN"]
[{"$nulls":18},"Número de Cuotas",null,12,null,null,"Prima Mínimo SD",null,null,{"$f":"IF(AND(Listas!D5=Listas!C2),IF(AA6=\"No Aplica\",AA6,1),IF(AA6=\"No Aplica\",AA6,(1/'Simulador '!$T$120)))","v":{"v":1,"d":"1.00"}},{"$nulls":6},{"$f":"Listas!AI2","v":"Min"},{"$f":"Listas!AJ2","v":{"v":1000,"d":"1,000"}},{"$f":"CONCATENATE(AH7,\" \",TEXT(AI7,\"#,##\"))","v":"Min 1,000"},null,{"$f":"Listas!K6","v":"CON SEGURO"},{"$f":"IF(AND(Listas!A5=Listas!B2,Listas!K6=Listas!L5),\"CORRECTO\",IF(AND(Listas!A5=Listas!B3,Listas!K6=Listas!L5),\"INCORRECTO\",\"CORRECTO\"))","v":"CORRECTO"}]
[{"$nulls":18},"Fecha de Desembolso",null,"2025-02-02",null,"(día/mes/año)","Valor de Cuota",null,null,{"$f":"C34","v":226},{"$nulls":6},{"$f":"Listas!AI3","v":"Max"},{"$f":"Listas!AJ3","v":{"v":300000,"d":"300,000"}},{"$f":"CONCATENATE(AH8,\" \",TEXT(AI8,\"#,##\"))","v":"Max 300,000"},null,null,"CORRECTO"]
[{"$nulls":18},{"$f":"IF(AND(Listas!A5=Listas!B3,Listas!H21=Listas!I15),\"Primer Pago Grupal↓\",\"Dia de Pago (Primer Pago)↓\")","v":"Dia de Pago (Primer Pago)↓"},null,16]
["Alerta","PRODUCTO ESPECIAL","IMPULSA PERU","Primeros 6 meses periodo de gracia parcial",{"$nulls":14},"Tipo de Tasa ↓",null,"TEM (Tasa Efectiva Mensual)",{"$nulls":12},{"$f":"Listas!AL1","v":"Rango de Tasas"},null,"Rango"]
[{"$nulls":18},"Digite la Tasa",null,{"v":0.04,"d":"4.00%"},{"$nulls":12},{"$f":"Listas!AL2","v":"Min"},{"$f":"Listas!AM2","v":{"v":0.1855,"d":"18.5500%"}},{"$f":"IF(Listas!AO5=Listas!AP3,Listas!AN2,'Simulador '!AI11)","v":{"v":0.014283999999999998,"d":"1.4284%"}},{"$f":"CONCATENATE(AH11,\" \",TEXT(AJ11,\"#.#####%\"))","v":"Min 1.4284%"}]
[null,"PRODUCTO",{"$f":"AM2","v":"VIVIENDA"},{"$nulls":15},"Seguro de Desgravamen ↓",null,"CON SEGURO",{"$nulls":12},{"$f":"Listas!AL3","v":"Max"},{"$f":"Listas!AM3","v":{"v":0.8845999999999999,"d":"88.4600%"}},{"$f":"IF(Listas!AO5=Listas!AP3,Listas!AN3,'Simulador '!AI12)","v":{"v":0.054229,"d":"5.4229%"}},{"$f":"CONCATENATE(AH12,\" \",TEXT(AJ12,\"#.######%\"))","v":"Max 5.4229%"}]
[null,"Grupal",{"$f":"Listas!U8","v":"MENSUAL"},{"$f":"VLOOKUP(C13,Listas!$Y$2:$Z$4,2,FALSE)","v":0},{"$nulls":14},"Periodicidad de Pago↓",null,"CADA 28 DIAS (CG)"]
[null,"Dia de pago",{"$f":"Listas!N24","v":16},{"$nulls":15},"Periodo de Gracia↓",null,180,{"$nulls":12},"Claves y Llaves"]
[null,"Estado de Cuenta",{"$nulls":31},"Monto",{"$f":"IF(AND(U6>=AI7,U6<=AI8),\"\",CONCATENATE(\"Revisar\",\" \",AH15,\" \",AJ7,\" \",AJ8))","v":""}]
[null,"ITF %",{"v":5e-05,"d":"0.005%"},{"$nulls":15},"Alerta:",{"$nulls":14},"N° de Cuota",{"$f":"IF(AND(U7>=AI3,U7<=AI4),\"\",CONCATENATE(\"Revisar\",\" \",AH16,\" \",AJ3,\" \",AJ4))","v":""}]
[null,"ITF Costo",{"$f":"C16*C33","v":0},null,{"$f":"((1+C25)^(M114/30))*C20","v":3532.371477125597},{"$nulls":13},{"$f":"IFERROR(CONCATENATE(AI15,\" \",AI16,\" \",AI17,\" \",AI18),\"Realice todos los cambios en los filtros\")","v":"   \""},{"$nulls":14},{"$f":"IF(U10=\"TEM (Tasa Efectiva Mensual)\",\"Tasa elegida TEM\",\"Tasa elegida TEA\")","v":"Tasa elegida TEM"},{"$f":"IF(AND(U11>=AJ11,U11<=AJ12),\"\",CONCATENATE(\"Revisar\",\" \",AH17,\" \",AK11,\" \",AK12))","v":""}]
[null,"Monto de Desembolso",{"$f":"U6","v":{"v":2000,"d":"2,000.00"}},{"$nulls":30},"SD",{"$f":"IF(AND(Listas!A5=Listas!B3,Listas!K6=Listas!L5),\"Seguro Desgravamen con devolución no aplica a CREDITO GRUPAL\",IF(AND(Listas!A5=Listas!B2,Listas!K6=Listas!L5,L114<720),\"Seguro Desgravamen con devolución aplica plazo mayor a 2 años\",IF(C14=0,\"Revisar de Pago\",\"\"\"\")))","v":"\""}]
[null,"Seguro financiado",{"v":0,"d":"0.00"}]
[null,"Monto de Desembolso Total",{"$f":"SUM(C18:C19)","v":{"v":2000,"d":"2,000.00"}}]
{"$rows_left_out":100}
{"sheet":"Listas","index":1,"n_rows":69,"n_cols":49,"rows_kept":69}
["COD","Nombre",{"$nulls":6},"Soles","Dolares",{"$nulls":3},"COD","Nombre",{"$nulls":5},"COD","Nombre",{"$nulls":6},"Rango Periodo de Gracia",null,null,"Rango de N° de Cuotas",null,null,"Rango de Monto",null,null,"Rango de Tasas","TEA","TEM",null,"TIPO DE TASA",{"$nulls":3},"Feriados",null,null,"https://www.wincalendar.com/es/Calendario-2021-Feriados-Peru-Excel#google_vignette"]
[2,"INDIVIDUAL",1,"SOLES","Si",null,1,{"$f":"IF(AND($B$5=$A$3,$D$5=$C$3),\"\",IF(AND($D$5=$C$2,$B$5=1),$I$16,IF($D$5=$C$2,I2,J2)))","v":"VIVIENDA"},"VIVIENDA","PYME",1,"CON SEGURO",null,1,{"$f":"IF(AND($I$21=$I$17,$U$7=$Y$3),Q34,IF(AND($I$21=$I$17,$U$7=$Y$4),P34,O34))","v":2},1,null,"No",null,null,1,{"$f":"IF($I$21=I17,Y3,$Y$2)","v":"MENSUAL"},null,null,"MENSUAL",null,null,1,{"$f":"'Reglas de CI'!B21","v":"No"},{"$f":"IF(AC2=\"No\",0,AC2)","v":0},null,"Min",{"$f":"IF(I21=I17,VLOOKUP(CONCATENATE(I21,U7),'Tabla Consolidada'!A:K,6,FALSE),VLOOKUP(I21,'Tabla Consolidada'!A:K,6,FALSE))","v":6},null,"Min",{"$f":"IF(D5=C2,IF(I21=I17,VLOOKUP(CONCATENATE(I21,U7),'Tabla Consolidada'!A:K,4,FALSE),VLOOKUP(I21,'Tabla Consolidada'!A:K,4,FALSE)),IF(I21=I17,VLOOKUP(CONCATENATE(I21,U7),'Tabla Consolidada'!A:M,12,FALSE),VLOOKUP(I21,'Tabla Consolidada'!A:M,12,FALSE)))","v":{"v":1000,"d":"1,000"}},null,"Min",{"$f":"IF(D5=C2,IF(I21=I17,VLOOKUP(CONCATENATE(I21,U7),'Tabla Consolidada'!A:K,8,FALSE),VLOOKUP(I21,'Tabla Consolidada'!A:K,8,FALSE)),IF(I21=I17,VLOOKUP(CONCATENATE(I21,U7),'Tabla Consolidada'!A:K,10,FALSE),VLOOKUP(I21,'Tabla Consolidada'!A:K,10,FALSE)))","v":{"v":0.1855,"d":"18.55%"}},{"$f":"IF(D5=C2,IF(I21=I17,VLOOKUP(CONCATENATE(I21,U7),'Tabla Consolidada'!A:O,14,FALSE),VLOOKUP(I21,'Tabla Consolidada'!A:O,14,FALSE)),IF(I21=I17,VLOOKUP(CONCATENATE(I21,U7),'Tabla Consolidada'!A:O,10,FALSE),VLOOKUP(I21,'Tabla Consolidada'!A:O,10,FALSE)))","v":{"v":0.014283999999999998,"d":"1.43%"}},1,"TEA (Tasa Efectiva Anual)",{"$nulls":3},"2021-01-01","Año Nuevo",1]
[1,"GRUPAL",2,"DOLARES","No",null,2,{"$f":"IF(AND($B$5=$A$3,$D$5=$C$3),\"\",IF(AND($D$5=$C$2,$B$5=1),$I$17,IF($D$5=$C$2,I3,J3)))","v":"LOCAL COMERCIAL"},"LOCAL COMERCIAL","ACTIVO FIJO",2,"SIN SEGURO",null,2,{"$f":"IF(AND($I$21=$I$17,$U$7=$Y$3),Q35,IF(AND($I$21=$I$17,$U$7=$Y$4),P35,O35))","v":3},2,null,"1 Mes",null,null,2,{"$f":"IF($I$21=I17,Y4,\"\")","v":""},null,null,"CADA 14 DIAS (CG)",14,null,2,{"$f":"'Reglas de CI'!B22","v":""},{"$f":"IF(AC3=\"No\",0,AC3)","v":""},null,"Max",{"$f":"IF(I21=I17,VLOOKUP(CONCATENATE(I21,U7),'Tabla Consolidada'!A:K,7,FALSE),VLOOKUP(I21,'Tabla Consolidada'!A:K,7,FALSE))","v":72},null,"Max",{"$f":"IF(D5=C2,IF(I21=I17,VLOOKUP(CONCATENATE(I21,U7),'Tabla Consolidada'!A:K,5,FALSE),VLOOKUP(I21,'Tabla Consolidada'!A:K,5,FALSE)),IF(I21=I17,VLOOKUP(CONCATENATE(I21,U7),'Tabla Consolidada'!A:M,13,FALSE),VLOOKUP(I21,'Tabla Consolidada'!A:M,13,FALSE)))","v":{"v":300000,"d":"300,000"}},null,"Max",{"$f":"IF(D5=C2,IF(I21=I17,VLOOKUP(CONCATENATE(I21,U7),'Tabla Consolidada'!A:K,9,FALSE),VLOOKUP(I21,'Tabla Consolidada'!A:K,9,FALSE)),IF(I21=I17,VLOOKUP(CONCATENATE(I21,U7),'Tabla Consolidada'!A:K,11,FALSE),VLOOKUP(I21,'Tabla Consolidada'!A:K,11,FALSE)))","v":{"v":0.8845999999999999,"d":"88.46%"}},{"$f":"IF(D5=C2,IF(I21=I17,VLOOKUP(CONCATENATE(I21,U7),'Tabla Consolidada'!A:O,15,FALSE),VLOOKUP(I21,'Tabla Consolidada'!A:O,15,FALSE)),IF(I21=I17,VLOOKUP(CONCATENATE(I21,U7),'Tabla Consolidada'!A:O,10,FALSE),VLOOKUP(I21,'Tabla Consolidada'!A:O,10,FALSE)))","v":{"v":0.054229,"d":"5.42%"}},2,"TEM (Tasa Efectiva Mensual)",{"$nulls":3},"2021-02-15","Carnaval (Lunes)",1]
[{"$nulls":6},3,{"$f":"IF(AND($B$5=$A$3,$D$5=$C$3),\"\",IF(AND($D$5=$C$2,$B$5=1),\"\",IF($D$5=$C$2,I4,J4)))","v":"EFECTIVO"},"EFECTIVO","COMPRA DE DEUDA",3,"ENDOSADO",null,3,4,3,null,"2 Meses",{"$nulls":6},"CADA 28 DIAS (CG)",28,null,3,{"$f":"'Reglas de CI'!B23","v":""},"",{"$nulls":15},"2021-04-01","Jueves Santo",1]
[{"$f":"'Simulador '!U3","v":"INDIVIDUAL"},{"$f":"_xlfn.XLOOKUP(A5,B2:B3,A2:A3,\"x\",0,1)","v":2},null,{"$f":"_xlfn.XLOOKUP(D6,D2:D3,C2:C3,\"x\",0,1)","v":1},null,null,4,"SUPERFACIL","SUPERFACIL","LOCAL COMERCIAL",4,"CON DEVOLUCIÓN",null,4,6,4,null,"3 Meses",{"$nulls":9},4,{"$f":"'Reglas de CI'!B24","v":""},"",{"$nulls":10},{"$f":"'Simulador '!U10","v":"TEM (Tasa Efectiva Mensual)"},{"$f":"_xlfn.XLOOKUP(AO5,AP2:AP3,AO2:AO3,\"x\",0,1)","v":2},{"$nulls":3},"2021-04-02","Viernes Santo",1]
[{"$nulls":3},{"$f":"'Simulador '!U4","v":"SOLES"},null,null,5,"ACTIVO FIJO","ACTIVO FIJO","EMPRESARIO",{"$f":"VLOOKUP(L6,K2:L5,2,FALSE)","v":"CON SEGURO"},{"$f":"_xlfn.XLOOKUP(L7,L2:L5,K2:K5,\"x\",0,1)","v":1},null,5,8,5,{"$nulls":11},5,{"$f":"'Reglas de CI'!B25","v":""},"",{"$nulls":15},"2021-05-01","Día del Trabajo",1]
[{"$nulls":6},6,"AGRO","AGRO","VIVIENDA",null,{"$f":"'Simulador '!U12","v":"CON SEGURO"},null,6,10,6,{"$nulls":4},{"$f":"IF(I21=I16,$Y$2,'Simulador '!U13)","v":"CADA 28 DIAS (CG)"},{"$f":"_xlfn.XLOOKUP(U7,V2:V5,U2:U5,\"x\",0,1)","v":"x"},{"$nulls":5},6,{"$f":"'Reglas de CI'!B26","v":""},"",{"$nulls":15},"2021-05-13","Ascensión",1]
[{"$nulls":6},7,"EMPRESARIO","EMPRESARIO",{"$nulls":4},7,12,7,{"$nulls":4},{"$f":"'Simulador '!AO2","v":"MENSUAL"},{"$nulls":6},7,{"$f":"'Reglas de CI'!B27","v":""},"",{"$nulls":15},"2021-06-29","San Pedro y San Pablo",1]
[{"$nulls":6},8,"PYME","PYME",{"$nulls":4},8,14,8,{"$nulls":11},8,{"$f":"'Reglas de CI'!B28","v":""},"",{"$nulls":15},"2021-07-28","Independencia del Perú",1]
[{"$nulls":6},9,"COMPRA DE DEUDA","COMPRA DE DEUDA",{"$nulls":4},9,16,9,{"$nulls":11},9,{"$f":"'Reglas de CI'!B29","v":""},"",{"$nulls":15},"2021-07-29","Día de las Fuerzas Armadas",1]
[{"$nulls":6},10,"IMPULSA PERU","IMPULSA PERU",{"$nulls":4},10,18,10,{"$nulls":29},"2021-08-30","Santa Rosa de Lima",1]
[{"$nulls":6},11,"CASH","CASH",{"$nulls":4},11,20,11,{"$nulls":11},{"$f":"IF(AC12=\"x\",0,VLOOKUP(AC12,AB2:AD10,3))","v":0},{"$f":"_xlfn.XLOOKUP(AC13,AC2:AC10,AB2:AB10,\"x\",0,1)","v":"x"},{"$nulls":16},"2021-10-08","Combate Naval de Angamos",1]
[{"$nulls":6},12,"VUELVE","VUELVE",{"$nulls":4},12,22,12,{"$nulls":12},{"$f":"'Simulador '!U14","v":180},{"$nulls":16},"2021-11-01","Día de Todos los Santos",1]
[{"$nulls":6},13,"LÍNEA DE CRÉDITO","LÍNEA DE CRÉDITO",{"$nulls":4},13,24,13,{"$nulls":29},"2021-12-08","Día de la Inmaculada Concepción",1]
[{"$nulls":6},14,"LÍNEA DE CRÉDITO CREDITIENDA","LÍNEA DE CRÉDITO CREDITIENDA",{"$nulls":4},14,{"$f":"IF(AND($I$21=$I$15,$U$7=$Y$3),Q47,IF(AND($I$21=$I$15,$U$7=$Y$4),P47,O47))","v":" "},14,{"$nulls":29},"2021-12-25","Navidad",1]
[{"$nulls":6},15,null,"CRECE Y MEJORA",{"$nulls":4},15," ",15,{"$nulls":29},"2022-01-01","Año Nuevo",1]
[{"$nulls":6},16,null,"CREDITO GRUPAL",{"$nulls":4},16," ",16,{"$nulls":29},"2022-02-28","Carnaval (Lunes)",1]
[{"$nulls":13},17," ",17,{"$nulls":29},"2022-04-14","Jueves Santo",1]
[{"$f":"IF(H21=I14,B2,IF(A5=B2,B2,A5))","v":"INDIVIDUAL"},{"$nulls":6},{"$f":"_xlfn.XLOOKUP(H21,H2:H16,G2:G16,\"x\",0,1)","v":"x"},{"$nulls":5},18," ",18,{"$nulls":29},"2022-04-15","Viernes Santo",1]
[{"$nulls":13},19," ",19,{"$nulls":29},"2022-05-01","Día del Trabajo",1]
{"$rows_left_out":50}
{"sheet":"Tabla Consolidada","index":2,"n_rows":21,"n_cols":17,"rows_kept":21,"merged":[[1,7,1,8],[1,13,1,14]]}
[1,{"$f":"+A1+1","v":2},{"$f":"+B1+1","v":3},4,5,6,7,8,9,10,11,12,13,14,15]
[{"$nulls":7},"TEA",{"$nulls":5},"TEM",null,null,"Antes:"]
[null,"Producto","Frecuencia","Monto mínimo","Monto máximo","Plazo mínimo (meses)","Plazo máximo (meses)","Tasa mínima soles","Tasa máxima soles","Tasa mínima dólares","Tasa máxima dólares","Monto mínimo USD","Monto máximo USD","Tasa mínima soles","Tasa máxima soles"]
[{"$f":"CONCATENATE(B4,C4)","v":"CREDITO GRUPALMENSUAL"},"CREDITO GRUPAL",{"$f":"Listas!V2","v":"MENSUAL"},{"v":1000,"d":"1,000"},{"v":13000,"d":"13,000"},8,10,{"v":1.0983,"d":"109.83%"},{"v":1.1298,"d":"112.98%"},0,0,null,null,{"$f":"+ROUND((1+H4)^(0.0833333333333333)-1,6)","v":{"v":0.063708,"d":"6.3708%"}},{"$f":"+ROUND((1+I4)^(0.0833333333333333)-1,6)","v":{"v":0.065029,"d":"6.5029%"}}]
[{"$f":"CONCATENATE(B5,C5)","v":"CREDITO GRUPAL"},"CREDITO GRUPAL",{"$f":"Listas!V3","v":""},{"v":1000,"d":"1,000"},{"v":13000,"d":"13,000"},4,8,{"v":1.0983,"d":"109.83%"},{"v":1.1298,"d":"112.98%"},0,0,null,null,{"v":0.063708,"d":"6.3708%"},{"$f":"+ROUND((1+I5)^(0.0833333333333333)-1,6)","v":{"v":0.065029,"d":"6.5029%"}}]
["CRECE Y MEJORA","CRECE Y MEJORA",null,{"v":1300,"d":"1,300"},{"v":10000,"d":"10,000"},6,18,{"v":0.5,"d":"50.00%"},{"v":0.82,"d":"82.00%"},0,0,null,null,{"$f":"+ROUND((1+H6)^(0.0833333333333333)-1,6)","v":{"v":0.034366,"d":"3.4366%"}},{"$f":"+ROUND((1+I6)^(0.0833333333333333)-1,6)","v":{"v":0.051169,"d":"5.1169%"}}]
[""]
["SUPERFACIL","SUPERFACIL",null,{"v":1000,"d":"1,000"},{"v":30000,"d":"30,000"},6,18,{"v":0.2452,"d":"24.52%"},{"v":1.0981999999999998,"d":"109.82%"},0,0,null,null,{"v":0.018444000000000002,"d":"1.8444%"},{"v":0.06370300000000001,"d":"6.3703%"}]
["EFECTIVO","EFECTIVO",null,{"v":1000,"d":"1,000"},{"v":20000,"d":"20,000"},6,24,{"v":0.22690000000000002,"d":"22.69%"},{"v":1.0979999999999999,"d":"109.80%"},0,0,null,null,{"v":0.01719,"d":"1.7190%"},{"v":0.063695,"d":"6.3695%"}]
["PYME","PYME",null,{"v":1000,"d":"1,000"},{"v":50000,"d":"50,000"},1,24,{"v":0.1855,"d":"18.55%"},{"v":0.8845999999999999,"d":"88.46%"},0,0,{"$f":"D10/'Simulador '!$T$120","v":{"$error":"#DIV/0!"}},{"$f":"E10/'Simulador '!$T$120","v":{"$error":"#DIV/0!"}},{"v":0.014283999999999998,"d":"1.4284%"},{"v":0.054229,"d":"5.4229%"}]
["ACTIVO FIJO","ACTIVO FIJO",null,{"v":1000,"d":"1,000"},{"v":50000,"d":"50,000"},6,72,{"v":0.1855,"d":"18.55%"},{"v":0.8845999999999999,"d":"88.46%"},0,0,{"$f":"D11/'Simulador '!$T$120","v":{"$error":"#DIV/0!"}},{"$f":"E11/'Simulador '!$T$120","v":{"$error":"#DIV/0!"}},{"v":0.014283999999999998,"d":"1.4284%"},{"v":0.054229,"d":"5.4229%"}]
["COMPRA DE DEUDA","COMPRA DE DEUDA",null,{"v":1000,"d":"1,000"},{"v":280000,"d":"280,000"},6,72,{"v":0.1855,"d":"18.55%"},{"v":0.8845999999999999,"d":"88.46%"},0,0,{"$f":"D12/'Simulador '!$T$120","v":{"$error":"#DIV/0!"}},{"$f":"E12/'Simulador '!$T$120","v":{"$error":"#DIV/0!"}},{"v":0.014283999999999998,"d":"1.4284%"},{"v":0.054229,"d":"5.4229%"}]
["LOCAL COMERCIAL","LOCAL COMERCIAL",null,{"v":1000,"d":"1,000"},{"v":300000,"d":"300,000"},6,72,{"v":0.1855,"d":"18.55%"},{"v":0.8845999999999999,"d":"88.46%"},0,0,{"$f":"D13/'Simulador '!$T$120","v":{"$error":"#DIV/0!"}},{"$f":"E13/'Simulador '!$T$120","v":{"$error":"#DIV/0!"}},{"v":0.014283999999999998,"d":"1.4284%"},{"v":0.054229,"d":"5.4229%"}]
["EMPRESARIO","EMPRESARIO",null,{"v":1000,"d":"1,000"},{"v":300000,"d":"300,000"},1,60,{"v":0.1796,"d":"17.96%"},{"v":0.8845999999999999,"d":"88.46%"},0,0,{"$f":"D14/'Simulador '!$T$120","v":{"$error":"#DIV/0!"}},{"$f":"E14/'Simulador '!$T$120","v":{"$error":"#DIV/0!"}},{"v":0.013857,"d":"1.3857%"},{"v":0.054229,"d":"5.4229%"}]
["VIVIENDA","VIVIENDA",null,{"v":1000,"d":"1,000"},{"v":300000,"d":"300,000"},6,72,{"v":0.1855,"d":"18.55%"},{"v":0.8845999999999999,"d":"88.46%"},0,0,{"$f":"D15/'Simulador '!$T$120","v":{"$error":"#DIV/0!"}},{"$f":"E15/'Simulador '!$T$120","v":{"$error":"#DIV/0!"}},{"v":0.014283999999999998,"d":"1.4284%"},{"v":0.054229,"d":"5.4229%"}]
["IMPULSA PERU","IMPULSA PERU",null,{"v":1000,"d":"1,000"},{"v":300000,"d":"300,000"},12,54,{"v":0.115,"d":"11.50%"},{"v":0.14,"d":"14.00%"},{"$nulls":4},{"$f":"+ROUND((1+H16)^(0.0833333333333333)-1,6)","v":{"v":0.009112,"d":"0.9112%"}},{"$f":"+ROUND((1+I16)^(0.0833333333333333)-1,6)","v":{"v":0.010979,"d":"1.0979%"}}]
["AGRO","AGRO",null,{"v":1000,"d":"1,000"},{"v":30000,"d":"30,000"},1,8,{"v":0.1855,"d":"18.55%"},{"v":0.8845999999999999,"d":"88.46%"},0,0,null,null,{"v":0.014283999999999998,"d":"1.4284%"},{"v":0.054229,"d":"5.4229%"}]
["CASH","CASH",null,{"v":1000,"d":"1,000"},{"v":50000,"d":"50,000"},12,18,{"v":0.1855,"d":"18.55%"},{"v":0.8845999999999999,"d":"88.46%"},0,0,null,null,{"v":0.014283999999999998,"d":"1.4284%"},{"v":0.054229,"d":"5.4229%"}]
["VUELVE","VUELVE",null,{"v":1000,"d":"1,000"},{"v":50000,"d":"50,000"},6,18,{"v":0.1855,"d":"18.55%"},{"v":0.8845999999999999,"d":"88.46%"},0,0,null,null,{"v":0.014283999999999998,"d":"1.4284%"},{"v":0.054229,"d":"5.4229%"}]
["LÍNEA DE CRÉDITO","LÍNEA DE CRÉDITO",null,{"v":1000,"d":"1,000"},{"v":120000,"d":"120,000"},6,24,{"v":0.22,"d":"22.00%"},{"v":0.73,"d":"73.00%"},{"$nulls":4},{"v":0.016708,"d":"1.6708%"},{"v":0.04673600000000001,"d":"4.6736%"}]
{"$rows_left_out":2}
{"sheet":"RangoTasa","index":3,"n_rows":0,"n_cols":0,"rows_kept":0}

{"sheet":"Hoja1","index":4,"n_rows":0,"n_cols":0,"rows_kept":0}

{"sheet":"Reglas de CI","index":5,"n_rows":29,"n_cols":23,"rows_kept":29,"merged":[[3,10,3,18]]}
[]
[]
[1,2,3,4,5,6,7,8,9,10,11,12,13,14,15,16,17,18,19,20,21,22,23]
["Producto","Monto mínimo","Monto máximo","Plazo mínimo (meses)","Plazo máximo (meses)","Tasa mínima soles","Tasa máxima soles","Tasa mínima dólares","Tasa máxima dólares","PRIMERA CUOTA 59 DIAS","periodo Libre",{"$nulls":9},"Periodo de Gracia"]
["SUPERFACIL",{"v":1000,"d":"1,000"},{"v":20000,"d":"20,000"},6,18,{"v":0.2282,"d":"22.82%"},{"v":0.8791,"d":"87.91%"},"No aplica","No aplica","Aplica","No"]
["EFECTIVO",{"v":1000,"d":"1,000"},{"v":30000,"d":"30,000"},6,24,{"v":0.2282,"d":"22.82%"},{"v":0.8791,"d":"87.91%"},"No aplica","No aplica","Aplica","No"]
["PYME",{"v":1000,"d":"1,000"},{"v":50000,"d":"50,000"},1,24,{"v":0.177,"d":"17.70%"},{"v":0.8791,"d":"87.91%"},"No aplica","No aplica","Aplica","No",30,60]
["ACTIVO FIJO",{"v":1000,"d":"1,000"},{"v":50000,"d":"50,000"},6,"36 a sola firma /\n72 con garantía real",{"v":0.177,"d":"17.70%"},{"v":0.8791,"d":"87.91%"},"No aplica","No aplica","Aplica","No",30,60,{"$nulls":7},1,2,3]
["COMPRA DE DEUDA",{"v":1000,"d":"1,000"},"Microempresa: S/50,000",6,"Capital de Trabajo: 18 meses.\nActivo Fijo:\nA sola firma: 36 meses.\nCon garantía real: Hasta 72 meses.",{"v":0.177,"d":"17.70%"},{"v":0.8791,"d":"87.91%"},"No aplica","No aplica","Aplica","No"]
["LOCAL COMERCIAL",{"v":1000,"d":"1,000"},"Pequeña Empresa:",6,"A sola firma: hasta 48 meses\nCon garantía real: hasta 72 meses",{"v":0.177,"d":"17.70%"},{"v":0.8791,"d":"87.91%"},"No aplica","No aplica","Aplica","No",30,60,{"$nulls":7},1,2,3]
["EMPRESARIO",{"v":1000,"d":"1,000"},"Capital de Trabajo: S/220,000",1,"Capital de Trabajo: Hasta 18 meses.\n*Score A 24 meses de S/50,000 hasta S/120,000\n\nActivo Fijo:\nA sola firma: 36 meses.\nCon garantía real: Hasta 72 meses",{"v":0.177,"d":"17.70%"},{"v":0.8791,"d":"87.91%"},"No aplica","No aplica","Aplica","No",30,60,90,{"$nulls":6},1,2,3]
["VIVIENDA",{"v":1000,"d":"1,000"},"Activo Fijo: S/280,000",6,"Dependientes Formales y Microempresa: 36\nPequeña empresa:\nSin garantía Hipotecaria 48 meses\nCon Garantía Real: 72 meses",{"v":0.177,"d":"17.70%"},{"v":0.8791,"d":"87.91%"},"No aplica","No aplica","Aplica","No",30,60,90,{"$nulls":6},1,2,3]
["IMPULSA PERU",{"v":1000,"d":"1,000"},{"$nulls":8},"No",180]
["AGRO",{"v":1000,"d":"1,000"},"Microempresa: S/50,000",1,"6 cuotas campaña chica / 8 cuotas campaña grande",{"v":0.177,"d":"17.70%"},{"v":0.8791,"d":"87.91%"},"No aplica","No aplica","Aplica","No",30,60,90,120,150,180,210,240,null,1,2,3]
[]
[]
["PRODUCTO",{"$f":"Listas!H21","v":"CRECE Y MEJORA"},{"$nulls":10},"Se agrega el periodo como gracia"]
["LINEA",{"$f":"Listas!A5","v":"INDIVIDUAL"}]
[]
[null,"RANGO GRACIA","Dias adicionales"]
{"$rows_left_out":9}